{"text_format":"1","workbook":"xlsx","n_sheets":8,"sheets":["Introduction","Eligibility","Funding Approval","Application Form","Initial Assessment","IAG","Next Steps","Dropdowns"],"not_rendered":{"charts":0,"images":17,"macros":1,"external_links":0,"defined_names":0,"comments":0,"pivot_tables":0},"unopened":[],"bounds":{"document_bytes":16777216,"sheet_cells":100000,"rows_first":2000,"rows_last":500,"rows_between":2000,"halvings":0,"cell_chars":16384,"cell_head_chars":4096},"cells_cut":0,"cells_raw":0,"read":"whole","date_system":"1900"}

{"sheet":"Introduction","index":0,"n_rows":31,"n_cols":2,"rows_kept":31,"cut":false,"hidden":false,"merged":[[1,1,2,6],[3,1,22,7],[30,1,32,7],[24,1,27,7]]}
[]
[null,"Serco Education Apprenticeship Application"]
[]
[null,"Before continuing with the application, please be aware that for any apprenticeships being applied for there are a number of checks that you must have completed.  These checks are:\n\nIf sourcing funding through your local authority, you must have checked that Serco Education are an approved supplier for your area.  If we are not, but you would still like to access our opportunities, before proceeding we would appreciate it if you could email apprenticeshipapplications@serco.com letting us know the Local Authority and any contact details you have, we will be happy to see if we can progress your application for you.\n\nYou must ensure that your funding manager, apprenticeship manager or procurement team can confirm that there are sufficient funds available in the school/trust/local authority’s levy fund account. Some LAs will require an internal approval process for their apprentices before they can apply - please check with your LA apprenticeship team first. *funding Mngr notification\n\nAlternative payment options are available for non-levy paying employers (employer co-investment scheme) – please contact us for more details or see gov.uk for more information. An updated scheme for non-levy employers was introduced from January 2020."]
[]
[]
[]
[]
[]
[]
[]
[]
[]
[]
[]
[]
[]
[]
[]
[]
[]
[]
[]
[]
[null,"A large requirement for any apprenticeship is that the employers must allow apprentices 20% of their time to undertake apprenticeship activities.  This is an ESFA requirement and is the minimum duration that be evidenced at the end of the apprenticeship"]
[]
[]
[]
[]
[]
[null,"I can confirm that I have read the above requirements and am sure that there is sufficient scope and funding for me to continue the application."]

{"sheet":"Eligibility","index":1,"n_rows":35,"n_cols":16,"rows_kept":35,"cut":false,"hidden":true,"merged":[[10,15,11,17],[14,1,15,6],[18,1,18,6],[19,11,19,12],[1,1,2,6],[3,1,3,6],[10,1,11,7],[34,1,36,7],[5,1,8,7],[30,10,33,13],[29,1,31,7],[14,9,16,12],[20,11,20,12],[21,1,22,7],[25,1,26,7],[25,10,26,13],[27,10,29,13],[10,10,11,12]]}
[]
[null,"Serco Education Apprenticeship Application"]
[]
[null,"Part 1. Eligibility"]
[]
[null,"Before we can process your application, you must ensure that you satisfy apprenticeship funding eligibility criteria and be willing to provide evidence of your eligibility, where requested, together with your completed application."]
[]
[]
[]
[]
["1.","Are you taking part in any other employment, learning or enterprise programme or scheme funded by the secretary of state?",null,null,null,null,null,null,null,{"$f":"IF(B13=\"Yes\",O11,\"\")","v":""},{"$f":"IF(B13=\"Yes\",P11,\"\")","v":""},null,null,null,1.1000000000000001,"If Yes, please confirm the end date of your funded programme"]
[]
[null,null,"please choose from drop down list"]
[]
["2.","Are you a UK or EEA (European Economic Area) Citizen or do you have the right to abode in the UK?",null,null,null,null,null,null,null,{"$f":"IF(B17=\"No\",O15,\"\")","v":""},null,null,null,null,"Important: If you are not a UK or EEA citizen, or have the right to abode, you will be ineligible for an apprenticeship"]
[]
[null,null,"please choose from drop down list"]
[]
["3. ","Have you been a resident in the UK for the previous 3 years?",null,null,null,null,null,null,null,{"$f":"IF(B20=\"No\",O19,\"\")","v":""},{"$f":"IF(B20=\"No\",P19,\"\")","v":""},null,null,null,3.1,"If No, where did you reside before the UK?"]
[null,null,"please choose from drop down list",null,null,null,null,null,null,null,{"$f":"IF(B20=\"No\",P20,\"\")","v":""},null,null,null,null,"Where?"]
[null,null,null,null,null,null,null,null,null,null,{"$f":"IF(B20=\"No\",P21,\"\")","v":""},null,null,null,null,"How Long?"]
["4.","Proof of ID to confirm residency eligibility and date of birth is required.  Certified copy to be attached to application email. (Tick as applicable)"]
[]
[]
[]
["5.","Do you hold a qualification, or have you completed an apprenticeship, at the same or higher level to the apprenticeship you are applying for?",null,null,null,null,null,null,null,{"$f":"IF(B28=\"Yes\",O26,\"\")","v":""},{"$f":"IF(B28=\"Yes\",P26,\"\")","v":""},null,null,null,5.0999999999999996,"If you have answered Yes, please state any qualifications you hold/apprenticeships completed at this or a higher level"]
[null,null,null,null,null,null,null,null,null,null,null,null,null,null,null,"N.B. You may only be eligible for this apprenticeship if your previous qualification(s) stated above is(are) materially different and you will acquire substantive new skills through completion of this apprenticeship."]
[null,null,"please choose from drop down list"]
[]
["6.","Are you suitably employed in a role that will offer opportunities to embed the knowledge, skills and behaviours, gained through this apprenticeship, that you need for your immediate job and future career?"]
[null,null,null,null,null,null,null,null,null,null,{"$f":"IF(B28=\"Yes\",P27,\"\")","v":""}]
[]
[null,null,"please choose from drop down list"]
[]
[null,"By ticking the following box, I confirm that the information provided above is correct and I am aware that eligibility criteria must be met before I am eligible to study an apprenticeship"]

{"sheet":"Funding Approval","index":2,"n_rows":46,"n_cols":17,"rows_kept":46,"cut":false,"hidden":true,"merged":[[15,11,17,14],[20,1,20,3],[20,5,20,8],[10,1,10,3],[11,1,11,3],[12,1,12,3],[13,1,13,3],[12,5,12,8],[13,5,13,6],[29,1,29,3],[27,5,27,8],[28,5,28,8],[29,5,29,8],[15,1,15,8],[22,1,24,8],[25,1,25,3],[26,1,26,3],[25,5,25,8],[26,5,26,8],[1,1,2,7],[3,1,3,8],[5,1,8,8],[10,5,10,8],[11,5,11,8],[45,1,47,8],[31,1,31,8],[35,1,35,2],[33,3,35,6],[37,1,37,5],[41,1,41,3],[42,1,42,3],[43,1,43,3],[41,5,41,8],[42,5,42,8],[43,5,43,8]]}
[]
[null,"Serco Education Apprenticeship Application"]
[]
[null,"Part 2. Funding Approval (To be completed by the Funding Manager)"]
[]
[null,"It is essential that funding is approved before the apprenticeship programme commences.\nN.B. Apprenticeship applications will not be processed without confirmed funding approval"]
[]
[]
[]
[]
[null,"Name of Funding Manager"]
[null,"Job Title"]
[null,"Email Address"]
[null,"Telephone Number",null,null,null,null,null,"Ext."]
[]
[null,"Please confirm if the applicant is from a levy-paying school/employer:",null,null,null,null,null,null,null,null,null,{"$f":"IF(B17=\"Non-Levy\",Q16,\"\")","v":""},null,null,null,null,"Remember: If you have selected Non-Levy, you MUST have registered with the DAS to reserve funds for this apprenticeship"]
[null,null,"please choose from drop down list"]
[]
[]
[]
[null,"Name of Local Authority"]
[]
[null,"Non-Levy, this next section MUST be completed as part of the application process.\nLevy-funded schools only need to complete this section if you OPT-IN for any additional accreditations available with the apprenticeship.\n\n"]
[]
[]
[null,"Accounts Payable Contact Name"]
[null,"Accounts Payable Address"]
[]
[]
[null,"Accounts Payable contact Email"]
[]
[null,"I confirm that funding is approved and the information above is correct."]
[]
[]
[]
[null,"Signed",null,null,null,null,null,"Date"]
[]
[null,"Please complete the following details:"]
[]
[null,"Empoyer's Liability Insurance"]
[]
[null,"Provider"]
[null,"Policy Number"]
[null,"Expiry Date"]
[]
[null,"By ticking the following box, I confirm that the information provided above is correct and I can confirm that there is funding available for an apprenticeship to be undertaken"]

{"sheet":"Application Form","index":3,"n_rows":102,"n_cols":20,"rows_kept":102,"cut":false,"hidden":true,"merged":[[1,1,2,8],[3,1,3,8],[6,1,6,2],[7,1,7,2],[7,4,7,5],[43,7,43,12],[21,5,21,10],[10,7,10,8],[15,1,16,2],[15,4,15,8],[16,4,16,8],[8,1,8,2],[8,4,8,5],[9,1,9,2],[9,4,9,5],[10,1,10,2],[10,4,10,5],[32,1,32,2],[32,4,32,7],[33,1,33,2],[33,4,33,7],[35,1,35,2],[37,1,37,4],[37,5,37,12],[13,19,13,20],[13,22,13,24],[29,1,29,2],[31,1,31,2],[31,4,31,7],[24,5,24,10],[25,5,25,10],[22,5,22,10],[24,1,24,2],[27,1,27,2],[27,4,27,5],[17,4,17,8],[18,4,18,8],[19,1,19,2],[19,4,19,5],[21,1,21,2],[22,1,22,2],[53,1,53,10],[55,1,57,10],[59,1,63,10],[45,1,47,5],[49,1,49,2],[51,1,51,10],[38,1,38,4],[40,1,40,2],[42,1,44,5],[39,1,39,4],[38,5,38,6],[46,7,46,12],[70,4,70,8],[71,4,71,8],[72,4,72,8],[73,4,73,8],[74,1,74,2],[74,4,74,5],[70,1,70,2],[65,1,65,2],[67,1,67,2],[68,1,68,2],[68,4,68,5],[68,7,68,8],[67,4,67,10],[68,9,68,10],[79,1,79,2],[79,4,79,8],[81,1,81,2],[81,4,81,8],[82,1,82,2],[83,1,83,2],[76,1,76,2],[77,1,77,2],[78,1,78,2],[76,4,76,8],[77,4,77,8],[78,4,78,8],[68,16,68,17],[7,15,8,17],[9,15,10,17],[13,1,13,2],[13,4,13,15],[10,9,10,13],[101,8,101,9],[99,2,101,5],[92,1,92,4],[92,5,92,7],[93,1,93,4],[94,1,94,5],[93,5,93,7],[87,1,87,4],[87,5,87,9],[89,1,89,4],[90,1,90,4],[91,1,91,4],[84,1,84,2],[82,4,82,8],[83,4,83,8],[84,4,84,8],[86,1,86,4],[86,5,86,7]]}
[]
[null,"Serco Education Apprenticeship Application"]
[]
[null,"Part 3. Application Form "]
[null,"(There may be a case where a cell is shaded both yellow and white once an answer is provided, please ignore this)"]
[]
[null,"Title",null,null,null,"please choose from drop down list"]
[null,"Forename",null,null,null,null,null,null,null,null,null,null,null,null,null,{"$f":"IF(E11=\"Prefer to self describe\",T8,\"\")","v":""},null,null,null,"Please tell us what would best describe your gender"]
[null,"Surname"]
[null,"Date of Birth"]
[null,"Gender",null,null,null,null,null,"Ethnicity"]
[null,null,null,null,null,null,null,null,null,"please choose from drop down list"]
[]
[null,{"$f":"IF('Funding Approval'!B17=\"Non-Levy\",\"Household Information\",\"\")","v":""},null,null,null,null,null,null,null,null,null,null,null,null,null,null,null,null,null,"Household Information"]
[]
[null,"Correspondence Address"]
[]
[]
[]
[null,"Postcode"]
[]
[null,"Email Address",null,null,"(Personal)"]
[null,null,null,null,"(Work)"]
[]
[null,"Contact Number",null,null,"(Personal)"]
[null,null,null,null,"(Work)"]
[]
[null,"NI Number"]
[]
[null,"Emergency Contact"]
[]
[null,"Name"]
[null,"Relationship"]
[null,"Telephone Number"]
[]
[null,"Course Details"]
[]
[null,"What would you like to study?",null,null,null,null,null,null,null,null,null,null,null,"please choose from drop down list"]
[null,"When would you like to start?",null,null,null,null,null,"please choose from drop down list"]
[null,"(Please select your desired term start)"]
[null,"Additional Support"]
[]
[null,"Do you have any learning difficulties (If yes, please select your primary difficulty)?"]
[null,null,null,null,null,null,null,null,null,null,null,null,null,"please choose from drop down list"]
[]
[null,"Do you have any disability, health or medical condition we should be aware of? (If yes, please select your primary condition)?"]
[null,null,null,null,null,null,null,null,null,null,null,null,null,"please choose from drop down list"]
[]
[]
[null,"Education"]
[]
[null,"Do you hold an English qualification at Level 2 or above (GCSE at A* - C / 9 - 4)?"]
[null,null,"please choose from drop down list"]
[null,"Do you hold an English qualification at Level 2 or above (GCSE at A* - C / 9 - 4)?"]
[null,null,"please choose from drop down list"]
[null,"Please attach copies of your certificates as evidence of your attainment.  If name on certificates is different, you must also provide proof of name change, e.g. marriage/civil partnership certificate."]
[]
[]
[]
[null,"N.B. If you do not provide evidence of your previous achievement at Level 2, you will be required to complete Level 2 Functional Skills in English and/or Maths, as this forms a mandatory element of the apprenticeship programme.  Arrangements will be made for you to begin Functional Skills, if needed within 2 months of the start date of your Apprenticeship"]
[]
[]
[]
[]
[]
[null,"Employment Details"]
[]
[null,"Place of Work"]
[null,"School Phase",null,null,null,null,null,"School Type"]
[null,null,null,null,"please choose from drop down list",null,null,null,null,"please choose from drop down list"]
[null,"School Address"]
[]
[]
[]
[null,"Postcode"]
[]
[null,"Line Manager Name"]
[null,"Line Manager job title"]
[null,"Line Manager tel. no."]
[null,"Line Manager email"]
[]
[null,"Name of Mentor (if diff)"]
[null,"Mentor job title"]
[null,"Mentor tel. no."]
[null,"Mentor email"]
[]
[null,"Start date of employment"]
[null,"Job Title"]
[]
[null,"Contracted weekly hours"]
[null,"Contracted weeks per year"]
[null,"Contracted days per week"]
[null,"Contract type"]
[null,"Notice Period"]
[null,"Salary meets minimum apprenticeship wage?",null,null,null,null,null,null,"please choose from drop down list"]
[]
[]
[null,"I confirm that the details I have provided in this application form are true and accurate:"]
[]
[]
[]
[null,"Signed",null,null,null,null,null,"Date"]

{"sheet":"Initial Assessment","index":4,"n_rows":20,"n_cols":10,"rows_kept":20,"cut":false,"hidden":true,"merged":[[1,1,2,7],[3,1,3,7],[4,1,18,7],[19,1,20,7]]}
[]
[null,"Serco Education Apprenticeship Application"]
[]
[null,"Part 4. Initial Assessment"]
[null,"As is required with all apprenticeships, it is important for us to understand what level you are currently working at in terms of your English and Maths skills.  \n\nFor us to do this, we require all our apprentices to complete an initial assessment online. This will then be assessed and shared among the delivery team of the apprenticeship to best position us to support in any identified target areas for improvement. \n\nOnce you have completed your application form and emailed it to the team, you will be provided further details and the links to complete the initial assessments in English and Maths. "]
[]
[]
[]
[]
[]
[]
[]
[]
[]
[]
[]
[null,null,null,null,null,null,null,null,null,{"$f":"IF('Application Form'!F38=\"Level 3: Teaching Assistant Apprenticeship\",1,(IF('Application Form'!F38=\"Level 4: School Business Professional Apprenticeship\",2,(IF('Application Form'!F38=\"Level 6: Chartered Manager Degree Apprenticeship for Schools\",3,0)))))","v":0}]
[]
[]
[null,"I confirm that I am prepared to complete the English and Maths initial assessments as part of the application process. "]

{"sheet":"IAG","index":5,"n_rows":55,"n_cols":2,"rows_kept":55,"cut":false,"hidden":true,"merged":[[42,1,45,5],[42,7,45,11],[47,1,51,5],[47,7,51,11],[54,1,54,7],[1,1,2,10],[3,1,3,11],[5,1,5,7],[7,1,10,5],[7,7,10,11],[37,1,40,5],[37,7,40,11],[12,1,17,5],[12,7,17,11],[19,1,25,5],[19,7,25,11],[27,1,35,5],[27,7,35,11]]}
[]
[null,"Serco Education Apprenticeship Application"]
[]
[null,"Part 5. Information, Advice and Guidance"]
[]
[null,"Please provide detailed answers to the following questions"]
[]
[null,"Why did you choose this apprenticeship programme?"]
[]
[]
[]
[]
[null,"What new skills and knowledge are you hoping to gain by completing the apprenticeship"]
[]
[]
[]
[]
[]
[]
[null,"How will the apprenticeship support you in your current role?"]
[]
[]
[]
[]
[]
[]
[]
[null,"You must complete, and provide evidence of, a minimum of 20% off-the-job training hours (i.e. 20% of your normal working hours) e.g. workshop attendance, coach meetings, portfolio building etc.  Please confirm that you have discussed and agreed this with your line manager, giving details and examples of how you have planned to meet this requirement"]
[]
[]
[]
[]
[]
[]
[]
[]
[]
[null,"What are your short-term goals (1-2 years)?"]
[]
[]
[]
[]
[null,"What are your longer-term goals (3-5 years)?"]
[]
[]
[]
[]
[null,"What are your career aspirations?"]
[]
[]
[]
[]
[]
[]
[null,"I confirm that I have answered each of the questions above"]

{"sheet":"Next Steps","index":6,"n_rows":33,"n_cols":10,"rows_kept":33,"cut":false,"hidden":true,"merged":[[3,1,3,11],[5,1,7,6],[9,1,10,6],[1,1,2,8],[32,1,32,3],[12,1,13,6],[15,1,16,6],[18,1,19,6],[21,1,28,8],[29,1,30,8]]}
[]
[null,"Serco Education Apprenticeship Application"]
[]
[null,"Part 6. Next Steps & CheckList"]
[]
[null,"All sections have been completed with accurate information and I have no queries or concerns regarding my eligbility for the apprenticeship programme"]
[]
[]
[]
[null,"There is sufficient funding available and this has been confirmed by the appropriate Funding Manager"]
[]
[]
[null,"I have certified proof of ID that I will attach to the submission email"]
[]
[]
[null,"I will complete the Functional Skills Assessments to identify my current level of English and Maths"]
[]
[null,null,null,null,null,null,null,null,null,{"$f":"IF('Application Form'!F38=\"Level 3: Teaching Assistant Apprenticeship\",1,(IF('Application Form'!F38=\"Level 4: School Business Professional Apprenticeship\",2,(IF('Application Form'!F38=\"Level 6: Chartered Manager Degree Apprenticeship for Schools\",3,(IF('Application Form'!F38=\"Level 7: Senior Leader Apprenticeship for School Business Professionals\",4,0)))))))","v":0}]
[null,"(If applicable) I will attach any evidence relating to change of name"]
[]
[]
[null,"Thank you for taking the time to complete your application.  Once you have submitted your application, it will be reviewed and an acknowlegement will be sent to you.\n\nIf we are happy that you are fully eligible to undertake the apprenticeship you selected, you will be sent a Skills Scan to complete with your line manager so that we can understand what level your current knowledge, skills and behaviours sit within the apprenticeship standards. *Cognassist"]
[]
[]
[]
[]
[]
[]
[]
[null,"Please submit this document, along with any any additional evidence required to the email address below:"]
[]
[]
[null,{"$f":"IF(J18=1,HYPERLINK(\"mailto:\"&Dropdowns!B26&\"?subject=\"&Dropdowns!C26&\"&body=\"&Dropdowns!D26,\"TAA Application Mailbox\"),IF(J18=2,HYPERLINK(\"mailto:\"&Dropdowns!B24&\"?subject=\"&Dropdowns!C24&\"&body=\"&Dropdowns!D24,\"SBPA Application Mailbox\"),IF(J18=3,HYPERLINK(\"mailto:\"&Dropdowns!B25&\"?subject=\"&Dropdowns!C25&\"&body=\"&Dropdowns!D25,\"CMDA Application Mailbox\"),IF(J18=4,HYPERLINK(\"mailto:\"&Dropdowns!B27&\"?subject=\"&Dropdowns!C27&\"&body=\"&Dropdowns!D27,\"SLA4SBP Application Mailbox\")))))","v":false}]

{"sheet":"Dropdowns","index":7,"n_rows":27,"n_cols":16,"rows_kept":27,"cut":false,"hidden":true,"merged":[]}
[]
[null,"Yes",null,"Levy",null,"Female",null,null,"Local authority",null,null,"British",null,null,null,"01. Visual Impairment"]
[null,"No",null,"Non-Levy",null,"Male",null,null,"MAT",null,null,"Irish",null,null,null,"02. Hearing Impairment"]
[null,null,null,null,null,"Prefer not to say",null,null,"Other",null,null,"Gypsy",null,null,null,"03. Disability affecting mobility"]
[null,null,null,null,null,"Prefer to self describe",null,null,null,null,null,"White and Black Caribbean",null,null,null,"04. Other Physical disability"]
[null,null,null,null,null,null,null,null,null,null,null,"White an Black African",null,null,null,"05. Other medical condition (epilepsy/asthma/diabetes)"]
[null,"Fixed ",null,"Academy",null,"Foundation",null,null,"CMDA Eng","https://forms.office.com/r/hRFERzsuSt",null,"White and Asian",null,null,null,"06. Emotional/behavioural difficulties"]
[null,"Permanent",null,"Comprehensive",null,"Intermediate",null,null,"CMDA Maths","https://forms.office.com/r/nAyFRGXd3g",null,"Other Mulitple or Mixed background",null,null,null,"07. Mental ill health"]
[null,null,null,"Faith",null,"Senior",null,null,"SBPA Eng","https://forms.office.com/r/vzVHjv0CFP",null,"Indian",null,null,null,"08. Temporary disability after illness (post-viral)"]
[null,null,null,"Grammar",null,"Further Education",null,null,"SBPA Maths","https://forms.office.com/r/m3SsTnSuRB",null,"Pakistani",null,null,null,"09. Profound complex disabilities"]
[null,"Mr",null,"Independent",null,null,null,null,null,null,null,"Bangladeshi",null,null,null,"10. Aspergers Syndrome"]
[null,"Mrs",null,"Nursery",null,"1: No household member is in employment and the household includes one or more dependent children ",null,null,null,null,null,"Chinese",null,null,null,"90. Multiple disablities"]
[null,"Miss",null,"Online",null,"2: No household member is in employment and the household does not include any dependent children ",null,null,null,null,null,"Any other Asian background",null,null,null,"97. Other"]
[null,"Ms",null,"State",null,"3: Learner lives in a single adult household with dependent children ",null,null,null,null,null,"African",null,null,null,"98. No Disability"]
[null,"Dr",null,null,null,"98: Learner has withheld this information ",null,null,null,null,null,"Caribbean",null,null,null,"99. Not known/information not provided"]
[null,null,null,null,null,"99: None of HHS1 / HHS2 or HHS3 applies ",null,null,null,null,null,"Any other Black, African or Caribbean background"]
[null,null,null,null,null,null,null,null,null,null,null,"Arab",null,null,null,"01. Moderate learning dfficulty"]
[null,"Level 3: Teaching Assistant Apprenticeship",null,null,null,null,null,null,"Next Available",null,null,"Any other ethnic group",null,null,null,"02. Severe learning difficulty"]
[null,"Level 4: School Business Professional Apprenticeship",null,null,null,null,null,null,"Spring Term",null,null,null,null,null,null,"10. Dyslexia"]
[null,"Level 6: Chartered Manager Degree Apprenticeship for Schools",null,null,null,null,null,null,"Summer Term",null,null,null,null,null,null,"11. Dyscalculia"]
[null,"Level 7: Senior Leader Apprenticeship for School Business Professionals",null,null,null,null,null,null,"Autumn Term",null,null,null,null,null,null,"19. Other specific learning difficulty"]
[null,null,null,null,null,null,null,null,"Winter Term",null,null,null,null,null,null,"20. Autism spectrum disorder"]
[null,null,null,null,null,null,null,null,null,null,null,null,null,null,null,"90. Multiple learning difficulties"]
[null,"apprenticeshipapplications@serco.com","[SBPA] Application for Review","*Please do not amend the subject of this email*",null,null,null,null,null,null,null,null,null,null,null,"97. Other"]
[null,"apprenticeshipapplications@serco.com","[CMDA] Application for Review","*Please do not amend the subject of this email*",null,null,null,null,null,null,null,null,null,null,null,"98. No learning difficulty"]
[null,"apprenticeshipapplications@serco.com","[TAA] Application for Review","*Please do not amend the subject of this email*",null,null,null,null,null,null,null,null,null,null,null,"99. Not known/information not provided"]
[null,"apprenticeshipapplications@serco.com","[SLA4SBP] Application for Review","*Please do not amend the subject of this email*"]